ORGANIZATION,PROGRAM,SORT SUBTOTAL DESCRIPTION,SORT SEQUENCE,TRANSACTION DATE,DATA SOURCE,DOCUMENT,VENDOR NAME,PERFORM START DT,PERFORM END DT,DESCRIPTION,AMOUNT                                                                                                                                           
2016 OFFICE OF THE SPEAKER,OFFICIAL EXPENSES - LEADERSHIP,SUPPLIES AND MATERIALS,DETAIL,18-Mar-16,AP,849255,CITI PCARD-GALLERIA FLORIST,29-Jan-16,28-Feb-16,HABITATION EXPENSE,380
2016 OFFICE OF THE SPEAKER,OFFICIAL EXPENSES - LEADERSHIP,SUPPLIES AND MATERIALS,SUBTOTAL,   ,   ,   ,   ,   ,   ,SUPPLIES AND MATERIALS TOTALS:,380
2016 OFFICE OF THE SPEAKER,OFFICIAL EXPENSES - LEADERSHIP,SUPPLIES AND MATERIALS,SUBTOTAL,   ,   ,   ,   ,   ,   ,OFFICIAL EXPENSES - LEADERSHIP TOTALS:,380
2016 OFFICE OF THE SPEAKER,GENERAL EXPENDITURES,PERSONNEL COMPENSATION,DETAIL,   ,   ,   ,ALTHOUSE JOSHUA S,1-Feb-16,31-Mar-16,CONSERV COALITION OUTREACH COR,6666.67
2016 OFFICE OF THE SPEAKER,GENERAL EXPENDITURES,PERSONNEL COMPENSATION,DETAIL,   ,   ,   ,ANDRES DOUGLAS R,3-Jan-16,31-Mar-16,PRESS SECRETARY,25666.67
2016 OFFICE OF THE SPEAKER,GENERAL EXPENDITURES,PERSONNEL COMPENSATION,DETAIL,   ,   ,   ,ANDREWS THOMAS S,3-Jan-16,31-Mar-16,MEMBER SERVICES COORDINATOR,18333.33
2016 OFFICE OF THE SPEAKER,GENERAL EXPENDITURES,PERSONNEL COMPENSATION,DETAIL,   ,   ,   ,ANTELL GEOFFREY,28-Jan-16,31-Mar-16,ASST TO THE SPEAKER FOR POLICY,26250
2016 OFFICE OF THE SPEAKER,GENERAL EXPENDITURES,PERSONNEL COMPENSATION,DETAIL,   ,   ,   ,BAILEY BRADLEY,3-Jan-16,30-Jan-16,ASSIST TO SPEAKER FOR POLICY,9333.33
2016 OFFICE OF THE SPEAKER,GENERAL EXPENDITURES,PERSONNEL COMPENSATION,DETAIL,   ,   ,   ,BENJAMIN WILLIAM C.,3-Jan-16,31-Mar-16,DIR OF INFORMATION TECHNOLOGY,23955.57
2016 OFFICE OF THE SPEAKER,GENERAL EXPENDITURES,PERSONNEL COMPENSATION,DETAIL,   ,   ,   ,BLAKE KRISTENE,3-Jan-16,31-Mar-16,DIR OF ADMIN OPERATIONS,31777.77
2016 OFFICE OF THE SPEAKER,GENERAL EXPENDITURES,PERSONNEL COMPENSATION,DETAIL,   ,   ,   ,BLANKENSHIP APRIL L.,3-Jan-16,31-Mar-16,FINANCIAL ADMINISTRATOR,6844.43
2016 OFFICE OF THE SPEAKER,GENERAL EXPENDITURES,PERSONNEL COMPENSATION,DETAIL,   ,   ,   ,BOLDUC BRIAN J.,3-Jan-16,31-Mar-16,DIRECTOR OF SPEECHWRITING,25666.67
2016 OFFICE OF THE SPEAKER,GENERAL EXPENDITURES,PERSONNEL COMPENSATION,DETAIL,   ,   ,   ,BROWN MARYAM S,3-Jan-16,30-Jan-16,APPOINTMENT DESK ASSISTANT,13066.67
2016 OFFICE OF THE SPEAKER,GENERAL EXPENDITURES,PERSONNEL COMPENSATION,DETAIL,   ,   ,   ,BROWN MARYAM S,1-Feb-16,31-Mar-16,ASST TO SPEAKER FOR POLICY,28000
2016 OFFICE OF THE SPEAKER,GENERAL EXPENDITURES,PERSONNEL COMPENSATION,DETAIL,   ,   ,   ,BUCK BRENDAN K,3-Jan-16,31-Mar-16,CHIEF ADV ON COMMUNICATIONS,42166.67
2016 OFFICE OF THE SPEAKER,GENERAL EXPENDITURES,PERSONNEL COMPENSATION,DETAIL,   ,   ,   ,BURKS JONATHAN,3-Jan-16,31-Mar-16,ASST TO SPEAKER FOR POLICY,32099.23
2016 OFFICE OF THE SPEAKER,GENERAL EXPENDITURES,PERSONNEL COMPENSATION,DETAIL,   ,   ,   ,CALLAS GEORGE A,3-Jan-16,31-Mar-16,CHIEF TAX COUNSEL,41725.7
2016 OFFICE OF THE SPEAKER,GENERAL EXPENDITURES,PERSONNEL COMPENSATION,DETAIL,   ,   ,   ,CASTINE PETER L,27-Jan-16,31-Mar-16,STAFF ASSISTANT,6222.23
2016 OFFICE OF THE SPEAKER,GENERAL EXPENDITURES,PERSONNEL COMPENSATION,DETAIL,   ,   ,   ,CASTINE PETER L,1-Feb-16,29-Feb-16,STAFF ASSISTANT (OVERTIME),416.46
2016 OFFICE OF THE SPEAKER,GENERAL EXPENDITURES,PERSONNEL COMPENSATION,DETAIL,   ,   ,   ,COYLE SARAH M,3-Jan-16,31-Mar-16,FLOOR ASSISTANT,10866.66
2016 OFFICE OF THE SPEAKER,GENERAL EXPENDITURES,PERSONNEL COMPENSATION,DETAIL,   ,   ,   ,CRAVEN KELLY F.,3-Jan-16,31-Mar-16,DIRECTOR OF HOUSE OPERATIONS,42166.67
2016 OFFICE OF THE SPEAKER,GENERAL EXPENDITURES,PERSONNEL COMPENSATION,DETAIL,   ,   ,   ,DAY VANESSA,3-Jan-16,31-Mar-16,SENIOR COMMUNICATIONS ADVISOR,25666.67
2016 OFFICE OF THE SPEAKER,GENERAL EXPENDITURES,PERSONNEL COMPENSATION,DETAIL,   ,   ,   ,DIXON KELLY A.,1-Feb-16,31-Mar-16,SHARED EMPLOYEE,16666.66
2016 OFFICE OF THE SPEAKER,GENERAL EXPENDITURES,PERSONNEL COMPENSATION,DETAIL,   ,   ,   ,DOCKERY DERRICK D,4-Jan-16,31-Mar-16,BUSINESS/STATE GOV OUTREACH CO,18125
2016 OFFICE OF THE SPEAKER,GENERAL EXPENDITURES,PERSONNEL COMPENSATION,DETAIL,   ,   ,   ,EASBY-SMITH ANNE S.,3-Jan-16,31-Mar-16,SPECIAL EVENTS COORDINATOR,18333.33
2016 OFFICE OF THE SPEAKER,GENERAL EXPENDITURES,PERSONNEL COMPENSATION,DETAIL,   ,   ,   ,EDWARDS SPENCER M,3-Jan-16,31-Mar-16,DEPUTY PRESS SECRETARY,13444.43
2016 OFFICE OF THE SPEAKER,GENERAL EXPENDITURES,PERSONNEL COMPENSATION,DETAIL,   ,   ,   ,EICHHORN JARED D.,3-Jan-16,31-Mar-16,CLOAKROOM DIRECTOR,22000
2016 OFFICE OF THE SPEAKER,GENERAL EXPENDITURES,PERSONNEL COMPENSATION,DETAIL,   ,   ,   ,EPLEY MARK D,3-Jan-16,31-Mar-16,GENERAL COUNSEL/OVERSIGHT,42166.67
2016 OFFICE OF THE SPEAKER,GENERAL EXPENDITURES,PERSONNEL COMPENSATION,DETAIL,   ,   ,   ,FOLTZ DEVON N,3-Jan-16,31-Mar-16,COUNSEL,29333.33
2016 OFFICE OF THE SPEAKER,GENERAL EXPENDITURES,PERSONNEL COMPENSATION,DETAIL,   ,   ,   ,GEFFERT REBEKAH L,3-Jan-16,31-Mar-16,STAFF ASSISTANT,8555.57
2016 OFFICE OF THE SPEAKER,GENERAL EXPENDITURES,PERSONNEL COMPENSATION,DETAIL,   ,   ,   ,GEFFERT REBEKAH L,1-Jan-16,29-Feb-16,STAFF ASSISTANT (OVERTIME),1060.08
2016 OFFICE OF THE SPEAKER,GENERAL EXPENDITURES,PERSONNEL COMPENSATION,DETAIL,   ,   ,   ,GILLESPIE JAMES M,25-Jan-16,31-Mar-16,CLERICAL TECHNICAN,6416.67
2016 OFFICE OF THE SPEAKER,GENERAL EXPENDITURES,PERSONNEL COMPENSATION,DETAIL,   ,   ,   ,GILLESPIE JAMES M,1-Feb-16,29-Feb-16,CLERICAL TECHNICAN (OVERTIME),25.24
2016 OFFICE OF THE SPEAKER,GENERAL EXPENDITURES,PERSONNEL COMPENSATION,DETAIL,   ,   ,   ,GOLDOUST CARAH S,3-Jan-16,31-Mar-16,STAFF ASSISTANT,8555.57
2016 OFFICE OF THE SPEAKER,GENERAL EXPENDITURES,PERSONNEL COMPENSATION,DETAIL,   ,   ,   ,GOLDOUST CARAH S,1-Jan-16,29-Feb-16,STAFF ASSISTANT (OVERTIME),1583.81
2016 OFFICE OF THE SPEAKER,GENERAL EXPENDITURES,PERSONNEL COMPENSATION,DETAIL,   ,   ,   ,HERRLE CYNTHIA A.,3-Jan-16,30-Jan-16,LOGISTICS & DIST SPEC (A),13066.67
2016 OFFICE OF THE SPEAKER,GENERAL EXPENDITURES,PERSONNEL COMPENSATION,DETAIL,   ,   ,   ,HERRLE CYNTHIA A.,1-Feb-16,31-Mar-16,ASST TO THE SPEAKER FOR POLICY,28000
2016 OFFICE OF THE SPEAKER,GENERAL EXPENDITURES,PERSONNEL COMPENSATION,DETAIL,   ,   ,   ,HIGGINS CASEY,3-Jan-16,31-Mar-16,ASSIST TO SPEAKER FOR POLICY,24444.43
2016 OFFICE OF THE SPEAKER,GENERAL EXPENDITURES,PERSONNEL COMPENSATION,DETAIL,   ,   ,   ,HOFFMANN MATTHEW,3-Jan-16,31-Mar-16,ASSIST TO SPEAKER FOR POLICY,37888.9
2016 OFFICE OF THE SPEAKER,GENERAL EXPENDITURES,PERSONNEL COMPENSATION,DETAIL,   ,   ,   ,HOPPE JOHN D,3-Jan-16,31-Mar-16,CHIEF OF STAFF,42166.67
2016 OFFICE OF THE SPEAKER,GENERAL EXPENDITURES,PERSONNEL COMPENSATION,DETAIL,   ,   ,   ,HUSTON JOHNATHON B,16-Jan-16,31-Mar-16,SHARED EMPLOYEE,10750
2016 OFFICE OF THE SPEAKER,GENERAL EXPENDITURES,PERSONNEL COMPENSATION,DETAIL,   ,   ,   ,JORDON BENJAMIN D,3-Jan-16,28-Mar-16,SPECIAL ASST TO THE SPEAKER,11944.45
2016 OFFICE OF THE SPEAKER,GENERAL EXPENDITURES,PERSONNEL COMPENSATION,DETAIL,   ,   ,   ,JORDON BENJAMIN D,29-Mar-16,31-Mar-16,STAFF ASSISTANT,194.44
2016 OFFICE OF THE SPEAKER,GENERAL EXPENDITURES,PERSONNEL COMPENSATION,DETAIL,   ,   ,   ,KITTLE ALLIE M,3-Jan-16,10-Jan-16,SHARED EMPLOYEE,408.33
2016 OFFICE OF THE SPEAKER,GENERAL EXPENDITURES,PERSONNEL COMPENSATION,DETAIL,   ,   ,   ,LEOPOLD PATRICK R,3-Jan-16,31-Mar-16,SHARED EMPLOYEE,24444.43
2016 OFFICE OF THE SPEAKER,GENERAL EXPENDITURES,PERSONNEL COMPENSATION,DETAIL,   ,   ,   ,LOZUPONE AMY S.,3-Jan-16,30-Jan-16,TRANSITION ADVISOR,1089.97
2016 OFFICE OF THE SPEAKER,GENERAL EXPENDITURES,PERSONNEL COMPENSATION,DETAIL,   ,   ,   ,MACDONALD BRIAN C.,3-Jan-16,31-Mar-16,SHARED EMPLOYEE,24444.43
2016 OFFICE OF THE SPEAKER,GENERAL EXPENDITURES,PERSONNEL COMPENSATION,DETAIL,   ,   ,   ,MARROLETTI CHRISTOPHER V,3-Jan-16,25-Mar-16,SENIOR STAFF ASSISTANT,9683.34
2016 OFFICE OF THE SPEAKER,GENERAL EXPENDITURES,PERSONNEL COMPENSATION,DETAIL,   ,   ,   ,MARROLETTI CHRISTOPHER V,1-Jan-16,29-Feb-16,SENIOR STAFF ASSISTANT (OVERTIME),832.92
2016 OFFICE OF THE SPEAKER,GENERAL EXPENDITURES,PERSONNEL COMPENSATION,DETAIL,   ,   ,   ,MATTHEWS TITUS V,14-Mar-16,31-Mar-16,INTERN,1652.78
2016 OFFICE OF THE SPEAKER,GENERAL EXPENDITURES,PERSONNEL COMPENSATION,DETAIL,   ,   ,   ,MCCALLIE CARLY L,6-Jan-16,31-Mar-16,ASSOCIATE COUNSEL,12986.1
2016 OFFICE OF THE SPEAKER,GENERAL EXPENDITURES,PERSONNEL COMPENSATION,DETAIL,   ,   ,   ,MCCANN EDWARD D.,3-Jan-16,31-Mar-16,ASSIST TO SPEAKER FOR POLICY,37888.9
2016 OFFICE OF THE SPEAKER,GENERAL EXPENDITURES,PERSONNEL COMPENSATION,DETAIL,   ,   ,   ,MEYER JOYCE Y.,3-Jan-16,31-Mar-16,DEPUTY CHIEF OF STAFF,42166.67
2016 OFFICE OF THE SPEAKER,GENERAL EXPENDITURES,PERSONNEL COMPENSATION,DETAIL,   ,   ,   ,MINKLER ANN W,3-Jan-16,31-Mar-16,FLOOR ASSISTANT,15888.9
2016 OFFICE OF THE SPEAKER,GENERAL EXPENDITURES,PERSONNEL COMPENSATION,DETAIL,   ,   ,   ,MITCHELL MAUREEN E,3-Jan-16,31-Mar-16,DIRECTOR OF SCHEDULING,26888.9
2016 OFFICE OF THE SPEAKER,GENERAL EXPENDITURES,PERSONNEL COMPENSATION,DETAIL,   ,   ,   ,O'TOOLE RYAN T,13-Jan-16,31-Mar-16,FLOOR ASSISTANT,8450
2016 OFFICE OF THE SPEAKER,GENERAL EXPENDITURES,PERSONNEL COMPENSATION,DETAIL,   ,   ,   ,PLANNING DAVID M,3-Jan-16,30-Jan-16,STAFF ASSISTANT,194.44
2016 OFFICE OF THE SPEAKER,GENERAL EXPENDITURES,PERSONNEL COMPENSATION,DETAIL,   ,   ,   ,POINTER KATHERINE C,3-Jan-16,31-Mar-16,STAFF ASSISTANT,8555.57
2016 OFFICE OF THE SPEAKER,GENERAL EXPENDITURES,PERSONNEL COMPENSATION,DETAIL,   ,   ,   ,POINTER KATHERINE C,1-Jan-16,29-Feb-16,STAFF ASSISTANT (OVERTIME),1527.02
2016 OFFICE OF THE SPEAKER,GENERAL EXPENDITURES,PERSONNEL COMPENSATION,DETAIL,   ,   ,   ,RENZ BRANDON,3-Jan-16,31-Mar-16,SHARED EMPLOYEE,24444.43
2016 OFFICE OF THE SPEAKER,GENERAL EXPENDITURES,PERSONNEL COMPENSATION,DETAIL,   ,   ,   ,RICCI MICHAEL,3-Jan-16,31-Mar-16,DIRECTOR OF COMMUNICATIONS,40333.33
2016 OFFICE OF THE SPEAKER,GENERAL EXPENDITURES,PERSONNEL COMPENSATION,DETAIL,   ,   ,   ,SAGER MICHAEL J,3-Jan-16,31-Mar-16,SYSTEMS ADMINISTRATOR,20777.77
2016 OFFICE OF THE SPEAKER,GENERAL EXPENDITURES,PERSONNEL COMPENSATION,DETAIL,   ,   ,   ,SHAPIRO MICHAEL I.,3-Jan-16,31-Mar-16,COMMUNICATIONS ADVISOR,14666.67
2016 OFFICE OF THE SPEAKER,GENERAL EXPENDITURES,PERSONNEL COMPENSATION,DETAIL,   ,   ,   ,SLINGSBY JULIA K.,3-Jan-16,31-Mar-16,DEPUTY COMMUNICATIONS DIRECTOR,22000
2016 OFFICE OF THE SPEAKER,GENERAL EXPENDITURES,PERSONNEL COMPENSATION,DETAIL,   ,   ,   ,SMITH CALEB J,3-Jan-16,31-Mar-16,DIGITAL COMMUNICATIONS DIRECTO,30555.57
2016 OFFICE OF THE SPEAKER,GENERAL EXPENDITURES,PERSONNEL COMPENSATION,DETAIL,   ,   ,   ,SMYTHE AUGUSTINE,3-Jan-16,31-Mar-16,POLICY DIRECTOR,42166.67
2016 OFFICE OF THE SPEAKER,GENERAL EXPENDITURES,PERSONNEL COMPENSATION,DETAIL,   ,   ,   ,SPETH ANDREW D.,3-Jan-16,31-Mar-16,SENIOR ADVISOR,21083.33
2016 OFFICE OF THE SPEAKER,GENERAL EXPENDITURES,PERSONNEL COMPENSATION,DETAIL,   ,   ,   ,STRONG ASHLEE A,3-Jan-16,31-Mar-16,PRESS SECRETARY,36666.67
2016 OFFICE OF THE SPEAKER,GENERAL EXPENDITURES,PERSONNEL COMPENSATION,DETAIL,   ,   ,   ,STRUNK LYDIA,3-Jan-16,31-Mar-16,DEPUTY FLOOR DIRECTOR,28111.1
2016 OFFICE OF THE SPEAKER,GENERAL EXPENDITURES,PERSONNEL COMPENSATION,DETAIL,   ,   ,   ,SWINEHART SARAH V,3-Jan-16,31-Mar-16,DIRECTOR OF MEDIA AFFAIRS,25666.67
2016 OFFICE OF THE SPEAKER,GENERAL EXPENDITURES,PERSONNEL COMPENSATION,DETAIL,   ,   ,   ,THORSEN ANNE B.,3-Jan-16,31-Mar-16,FLOOR DIRECTOR,42166.67
2016 OFFICE OF THE SPEAKER,GENERAL EXPENDITURES,PERSONNEL COMPENSATION,DETAIL,   ,   ,   ,VREEBURG JACOBUS A,16-Jan-16,31-Mar-16,SHARED EMPLOYEE,16666.67
2016 OFFICE OF THE SPEAKER,GENERAL EXPENDITURES,PERSONNEL COMPENSATION,DETAIL,   ,   ,   ,WHITE JERRY L,15-Jan-16,30-Jan-16,CHIEF CLERK/ OFC MGR/LEG COOR,3333.33
2016 OFFICE OF THE SPEAKER,GENERAL EXPENDITURES,PERSONNEL COMPENSATION,DETAIL,   ,   ,   ,WICKISER VICTORIA H,3-Jan-16,31-Mar-16,DEPUTY DIRECTOR OF SCHEDULING,18333.33
2016 OFFICE OF THE SPEAKER,GENERAL EXPENDITURES,PERSONNEL COMPENSATION,DETAIL,   ,   ,   ,ZULKOSKY ERIC T,3-Jan-16,31-Mar-16,SHARED EMPLOYEE,24444.44
2016 OFFICE OF THE SPEAKER,GENERAL EXPENDITURES,PERSONNEL COMPENSATION,SUBTOTAL,   ,   ,   ,   ,   ,   ,PERSONNEL COMPENSATION TOTALS:,1400132.67
2016 OFFICE OF THE SPEAKER,GENERAL EXPENDITURES,TRAVEL,DETAIL,26-Feb-16,AP,E0375432,CALLAS GEORGE A.,22-Feb-16,22-Feb-16,TAXI/PARKING/TOLLS,23
2016 OFFICE OF THE SPEAKER,GENERAL EXPENDITURES,TRAVEL,DETAIL,29-Mar-16,AP,E0386169,ALTHOUSE JOSHUA,16-Mar-16,16-Mar-16,TAXI/PARKING/TOLLS,24.27
2016 OFFICE OF THE SPEAKER,GENERAL EXPENDITURES,TRAVEL,SUBTOTAL,   ,   ,   ,   ,   ,   ,TRAVEL TOTALS:,47.27
2016 OFFICE OF THE SPEAKER,GENERAL EXPENDITURES,RENT  COMMUNICATION  UTILITIES,DETAIL,18-Feb-16,AP,843664,CITI PCARD-CAPITOL HOST,3-Jan-16,28-Jan-16,EQUIP RENTAL (EFF 1/3/03),90
2016 OFFICE OF THE SPEAKER,GENERAL EXPENDITURES,RENT  COMMUNICATION  UTILITIES,DETAIL,23-Mar-16,AP,E0384825,FEDEX,4-Mar-16,4-Mar-16,POSTAGE / COURIER / BOX RENTAL,12.65
2016 OFFICE OF THE SPEAKER,GENERAL EXPENDITURES,RENT  COMMUNICATION  UTILITIES,SUBTOTAL,   ,   ,   ,   ,   ,   ,RENT  COMMUNICATION  UTILITIES TOTALS:,102.65
2016 OFFICE OF THE SPEAKER,GENERAL EXPENDITURES,PRINTING AND REPRODUCTION,DETAIL,28-Jan-16,GL,PIX0055591, ,1-Jan-16,31-Jan-16,PHOTOGRAPHIC (TRANSFER),418
2016 OFFICE OF THE SPEAKER,GENERAL EXPENDITURES,PRINTING AND REPRODUCTION,DETAIL,24-Feb-16,GL,PIX0056298, ,1-Feb-16,29-Feb-16,PHOTOGRAPHIC (TRANSFER),6.4
2016 OFFICE OF THE SPEAKER,GENERAL EXPENDITURES,PRINTING AND REPRODUCTION,DETAIL,23-Mar-16,GL,PIX0057090, ,1-Mar-16,31-Mar-16,PHOTOGRAPHIC (TRANSFER),377.8
2016 OFFICE OF THE SPEAKER,GENERAL EXPENDITURES,PRINTING AND REPRODUCTION,SUBTOTAL,   ,   ,   ,   ,   ,   ,PRINTING AND REPRODUCTION TOTALS:,802.2
2016 OFFICE OF THE SPEAKER,GENERAL EXPENDITURES,OTHER SERVICES,DETAIL,11-Feb-16,AP,E0367835,ENGAGE CONCEPTS LLC,21-Jan-16,21-Jan-16,NON-TECHNOLOGY SERVICE CONTR,2447.81
2016 OFFICE OF THE SPEAKER,GENERAL EXPENDITURES,OTHER SERVICES,DETAIL,18-Mar-16,AP,849255,CITI PCARD-ALSOFT INC,29-Jan-16,28-Feb-16,TECHNOLOGY SERVICE CONTRACTS,128.9
2016 OFFICE OF THE SPEAKER,GENERAL EXPENDITURES,OTHER SERVICES,SUBTOTAL,   ,   ,   ,   ,   ,   ,OTHER SERVICES TOTALS:,2576.71
2016 OFFICE OF THE SPEAKER,GENERAL EXPENDITURES,SUPPLIES AND MATERIALS,DETAIL,22-Jan-16,AP,E0363979,ALICIA BARTON,6-Jan-16,6-Jan-16,HABITATION EXPENSE,200
2016 OFFICE OF THE SPEAKER,GENERAL EXPENDITURES,SUPPLIES AND MATERIALS,DETAIL,2-Feb-16,AP,E0366507,FIRST CHOICE COFFEE SERVICES,14-Jan-16,14-Jan-16,FOOD & BEVERAGE,315.45
2016 OFFICE OF THE SPEAKER,GENERAL EXPENDITURES,SUPPLIES AND MATERIALS,DETAIL,2-Feb-16,AP,E0366508,FIRST CHOICE COFFEE SERVICES,11-Jan-16,11-Jan-16,FOOD & BEVERAGE,397.5
2016 OFFICE OF THE SPEAKER,GENERAL EXPENDITURES,SUPPLIES AND MATERIALS,DETAIL,2-Feb-16,AP,E0366509,FIRST CHOICE COFFEE SERVICES,7-Jan-16,7-Jan-16,FOOD & BEVERAGE,525.31
2016 OFFICE OF THE SPEAKER,GENERAL EXPENDITURES,SUPPLIES AND MATERIALS,DETAIL,4-Feb-16,AP,E0367838,EASBY-SMITH ANNE S.,1-Feb-16,1-Feb-16,FOOD & BEVERAGE,51.13
2016 OFFICE OF THE SPEAKER,GENERAL EXPENDITURES,SUPPLIES AND MATERIALS,DETAIL,8-Feb-16,AP,E0369581,FIRST CHOICE COFFEE SERVICES,3-Feb-16,3-Feb-16,FOOD & BEVERAGE,498.21
2016 OFFICE OF THE SPEAKER,GENERAL EXPENDITURES,SUPPLIES AND MATERIALS,DETAIL,8-Feb-16,AP,E0369582,DAIOHS FIRST CHOICE COFFEE SERVICES,20-Jan-16,20-Jan-16,FOOD & BEVERAGE,190.42
2016 OFFICE OF THE SPEAKER,GENERAL EXPENDITURES,SUPPLIES AND MATERIALS,DETAIL,8-Feb-16,AP,E0369583,FIRST CHOICE COFFEE SERVICES,4-Feb-16,4-Feb-16,FOOD & BEVERAGE,119.9
2016 OFFICE OF THE SPEAKER,GENERAL EXPENDITURES,SUPPLIES AND MATERIALS,DETAIL,18-Feb-16,AP,843664,CITI PCARD-ADOBE  CREATIVE CLOUD,3-Jan-16,28-Jan-16,SOFTWARE  LESS THAN  $500,158.59
2016 OFFICE OF THE SPEAKER,GENERAL EXPENDITURES,SUPPLIES AND MATERIALS,DETAIL,18-Feb-16,AP,843664,CITI PCARD-BUCA DI BEPPO,3-Jan-16,28-Jan-16,FOOD & BEVERAGE,363.5
2016 OFFICE OF THE SPEAKER,GENERAL EXPENDITURES,SUPPLIES AND MATERIALS,DETAIL,18-Feb-16,AP,843664,CITI PCARD-DT,3-Jan-16,28-Jan-16,FOOD & BEVERAGE,265.6
2016 OFFICE OF THE SPEAKER,GENERAL EXPENDITURES,SUPPLIES AND MATERIALS,DETAIL,18-Feb-16,AP,843664,CITI PCARD-EINSTEIN BROS,3-Jan-16,28-Jan-16,FOOD & BEVERAGE,244.92
2016 OFFICE OF THE SPEAKER,GENERAL EXPENDITURES,SUPPLIES AND MATERIALS,DETAIL,18-Feb-16,AP,843664,CITI PCARD-SAFEWAY STORE,3-Jan-16,28-Jan-16,HABITATION EXPENSE,21.18
2016 OFFICE OF THE SPEAKER,GENERAL EXPENDITURES,SUPPLIES AND MATERIALS,DETAIL,18-Feb-16,AP,843664,CITI PCARD-TAYLOR GOURMET,3-Jan-16,28-Jan-16,FOOD & BEVERAGE,84.38
2016 OFFICE OF THE SPEAKER,GENERAL EXPENDITURES,SUPPLIES AND MATERIALS,DETAIL,18-Feb-16,AP,843664,CITI PCARD-WHOLEFDS PST,3-Jan-16,28-Jan-16,FOOD & BEVERAGE,510.92
2016 OFFICE OF THE SPEAKER,GENERAL EXPENDITURES,SUPPLIES AND MATERIALS,DETAIL,19-Feb-16,AP,E0373269,POLITICO LLC,13-Feb-16,12-Feb-17,PUBLICATIONS/REFERENCE MAT'L,9990
2016 OFFICE OF THE SPEAKER,GENERAL EXPENDITURES,SUPPLIES AND MATERIALS,DETAIL,26-Feb-16,AP,E0375425,FIRST CHOICE COFFEE SERVICES,11-Feb-16,11-Feb-16,FOOD & BEVERAGE,837.07
2016 OFFICE OF THE SPEAKER,GENERAL EXPENDITURES,SUPPLIES AND MATERIALS,DETAIL,26-Feb-16,AP,E0375426,FIRST CHOICE COFFEE SERVICES,18-Feb-16,18-Feb-16,FOOD & BEVERAGE,219.57
2016 OFFICE OF THE SPEAKER,GENERAL EXPENDITURES,SUPPLIES AND MATERIALS,DETAIL,26-Feb-16,AP,E0375428,FIRST CHOICE COFFEE SERVICES,19-Feb-16,19-Feb-16,FOOD & BEVERAGE,129.5
2016 OFFICE OF THE SPEAKER,GENERAL EXPENDITURES,SUPPLIES AND MATERIALS,DETAIL,26-Feb-16,AP,E0375429,COCA-COLA REFRESHMENTS USA INC,23-Feb-16,23-Feb-16,FOOD & BEVERAGE,120
2016 OFFICE OF THE SPEAKER,GENERAL EXPENDITURES,SUPPLIES AND MATERIALS,DETAIL,26-Feb-16,AP,E0375430,FIRST CHOICE COFFEE SERVICES,8-Feb-16,8-Feb-16,FOOD & BEVERAGE,297
2016 OFFICE OF THE SPEAKER,GENERAL EXPENDITURES,SUPPLIES AND MATERIALS,DETAIL,26-Feb-16,AP,E0375431,VREEBURG JACOBUS A.,2-Feb-16,2-Feb-16,FOOD & BEVERAGE,166.63
2016 OFFICE OF THE SPEAKER,GENERAL EXPENDITURES,SUPPLIES AND MATERIALS,DETAIL,26-Feb-16,AP,E0375435,BLANKENSHIP APRIL L.,24-Feb-16,24-Feb-16,OFFICE SUPPLIES (OUTSIDE),2.12
2016 OFFICE OF THE SPEAKER,GENERAL EXPENDITURES,SUPPLIES AND MATERIALS,DETAIL,29-Feb-16,AP,E0376362,FIRST CHOICE COFFEE SERVICES,25-Feb-16,25-Feb-16,FOOD & BEVERAGE,617.95
2016 OFFICE OF THE SPEAKER,GENERAL EXPENDITURES,SUPPLIES AND MATERIALS,DETAIL,1-Mar-16,AP,E0376654,DESIGN CUISINE,12-Jan-16,12-Jan-16,FOOD & BEVERAGE,2915
2016 OFFICE OF THE SPEAKER,GENERAL EXPENDITURES,SUPPLIES AND MATERIALS,DETAIL,7-Mar-16,AP,E0378829,FIRST CHOICE COFFEE SERVICES,2-Mar-16,2-Mar-16,FOOD & BEVERAGE,274.54
2016 OFFICE OF THE SPEAKER,GENERAL EXPENDITURES,SUPPLIES AND MATERIALS,DETAIL,9-Mar-16,AP,E0379693,VREEBURG JACOBUS A.,28-Feb-16,28-Feb-16,WATER,7.98
2016 OFFICE OF THE SPEAKER,GENERAL EXPENDITURES,SUPPLIES AND MATERIALS,DETAIL,9-Mar-16,AP,E0379693,VREEBURG JACOBUS A.,2-Mar-16,2-Mar-16,FOOD & BEVERAGE,166.63
2016 OFFICE OF THE SPEAKER,GENERAL EXPENDITURES,SUPPLIES AND MATERIALS,DETAIL,18-Mar-16,AP,849255,CITI PCARD-ADOBE  CREATIVE CLOUD,29-Jan-16,28-Feb-16,SOFTWARE  LESS THAN  $500,158.59
2016 OFFICE OF THE SPEAKER,GENERAL EXPENDITURES,SUPPLIES AND MATERIALS,DETAIL,18-Mar-16,AP,849255,CITI PCARD-AMAZON MKTPLACE PMTS,29-Jan-16,28-Feb-16,FOOD & BEVERAGE,114.62
2016 OFFICE OF THE SPEAKER,GENERAL EXPENDITURES,SUPPLIES AND MATERIALS,DETAIL,18-Mar-16,AP,849255,CITI PCARD-BOB EVANS REST,29-Jan-16,28-Feb-16,FOOD & BEVERAGE,1813
2016 OFFICE OF THE SPEAKER,GENERAL EXPENDITURES,SUPPLIES AND MATERIALS,DETAIL,18-Mar-16,AP,849255,CITI PCARD-BUCA DI BEPPO,29-Jan-16,28-Feb-16,FOOD & BEVERAGE,587.67
2016 OFFICE OF THE SPEAKER,GENERAL EXPENDITURES,SUPPLIES AND MATERIALS,DETAIL,18-Mar-16,AP,849255,CITI PCARD-CAFE RIO MEXICAN GRILL,29-Jan-16,28-Feb-16,FOOD & BEVERAGE,285.67
2016 OFFICE OF THE SPEAKER,GENERAL EXPENDITURES,SUPPLIES AND MATERIALS,DETAIL,18-Mar-16,AP,849255,CITI PCARD-CAPITOLHOST,29-Jan-16,28-Feb-16,FOOD & BEVERAGE,11.25
2016 OFFICE OF THE SPEAKER,GENERAL EXPENDITURES,SUPPLIES AND MATERIALS,DETAIL,18-Mar-16,AP,849255,CITI PCARD-CORNER BAKERY,29-Jan-16,28-Feb-16,FOOD & BEVERAGE,704
2016 OFFICE OF THE SPEAKER,GENERAL EXPENDITURES,SUPPLIES AND MATERIALS,DETAIL,18-Mar-16,AP,849255,CITI PCARD-DRI STELLAR PHOENIX SW,29-Jan-16,28-Feb-16,SOFTWARE  LESS THAN  $500,39
2016 OFFICE OF THE SPEAKER,GENERAL EXPENDITURES,SUPPLIES AND MATERIALS,DETAIL,18-Mar-16,AP,849255,CITI PCARD-EINSTEIN BROS-ONLINE C,29-Jan-16,28-Feb-16,FOOD & BEVERAGE,78.97
2016 OFFICE OF THE SPEAKER,GENERAL EXPENDITURES,SUPPLIES AND MATERIALS,DETAIL,18-Mar-16,AP,849255,CITI PCARD-FTP FINANCIAL TIMES,29-Jan-16,28-Feb-16,PUBLICATIONS/REFERENCE MAT'L,335.4
2016 OFFICE OF THE SPEAKER,GENERAL EXPENDITURES,SUPPLIES AND MATERIALS,DETAIL,18-Mar-16,AP,849255,CITI PCARD-PRET A MANGER,29-Jan-16,28-Feb-16,FOOD & BEVERAGE,55.69
2016 OFFICE OF THE SPEAKER,GENERAL EXPENDITURES,SUPPLIES AND MATERIALS,DETAIL,18-Mar-16,AP,849255,CITI PCARD-TAYLOR GOURMET,29-Jan-16,28-Feb-16,FOOD & BEVERAGE,445.19
2016 OFFICE OF THE SPEAKER,GENERAL EXPENDITURES,SUPPLIES AND MATERIALS,DETAIL,23-Mar-16,AP,E0384828,FIRST CHOICE COFFEE SERVICES,10-Mar-16,10-Mar-16,FOOD & BEVERAGE,1183.34
2016 OFFICE OF THE SPEAKER,GENERAL EXPENDITURES,SUPPLIES AND MATERIALS,DETAIL,23-Mar-16,AP,E0384829,FIRST CHOICE COFFEE SERVICES,16-Mar-16,16-Mar-16,FOOD & BEVERAGE,832.15
2016 OFFICE OF THE SPEAKER,GENERAL EXPENDITURES,SUPPLIES AND MATERIALS,SUBTOTAL,   ,   ,   ,   ,   ,   ,SUPPLIES AND MATERIALS TOTALS:,26335.54
2016 OFFICE OF THE SPEAKER,GENERAL EXPENDITURES,EQUIPMENT,DETAIL,3-Mar-16,AP,E0377897,THORSEN ANNE B.,26-Jan-16,26-Jan-16,MAINTENANCE / REPAIRS,115.54
2016 OFFICE OF THE SPEAKER,GENERAL EXPENDITURES,EQUIPMENT,SUBTOTAL,   ,   ,   ,   ,   ,   ,EQUIPMENT TOTALS:,115.54
2016 OFFICE OF THE SPEAKER,GENERAL EXPENDITURES,EQUIPMENT,SUBTOTAL,   ,   ,   ,   ,   ,   ,GENERAL EXPENDITURES TOTALS:,1430112.58
2016 OFFICE OF THE SPEAKER,GENERAL EXPENDITURES,EQUIPMENT,GRAND TOTAL FOR ORGANIZATION,   ,   ,   ,   ,   ,   ,OFFICE TOTALS: ,1430492.58
2015 OFFICE OF THE SPEAKER,GENERAL EXPENDITURES,PERSONNEL COMPENSATION,DETAIL,   ,   ,   ,ANDRES DOUGLAS R,1-Jan-16,2-Jan-16,PRESS SECRETARY,583.33
2015 OFFICE OF THE SPEAKER,GENERAL EXPENDITURES,PERSONNEL COMPENSATION,DETAIL,   ,   ,   ,ANDREWS THOMAS S,1-Jan-16,2-Jan-16,MEMBER SERVICES COORDINATOR,416.67
2015 OFFICE OF THE SPEAKER,GENERAL EXPENDITURES,PERSONNEL COMPENSATION,DETAIL,   ,   ,   ,BAILEY BRADLEY,1-Jan-16,2-Jan-16,ASSIST TO SPEAKER FOR POLICY,666.67
2015 OFFICE OF THE SPEAKER,GENERAL EXPENDITURES,PERSONNEL COMPENSATION,DETAIL,   ,   ,   ,BAILEY BRADLEY,1-Jan-16,2-Jan-16,ASSIST TO SPEAKER FOR POLICY (OTHER COMPENSATION),4000
2015 OFFICE OF THE SPEAKER,GENERAL EXPENDITURES,PERSONNEL COMPENSATION,DETAIL,   ,   ,   ,BENJAMIN WILLIAM C.,1-Jan-16,2-Jan-16,DIR OF INFORMATION TECHNOLOGY,544.44
2015 OFFICE OF THE SPEAKER,GENERAL EXPENDITURES,PERSONNEL COMPENSATION,DETAIL,   ,   ,   ,BLAKE KRISTENE,1-Jan-16,2-Jan-16,DIR OF ADMIN OPERATIONS,722.22
2015 OFFICE OF THE SPEAKER,GENERAL EXPENDITURES,PERSONNEL COMPENSATION,DETAIL,   ,   ,   ,BLANKENSHIP APRIL L.,1-Jan-16,2-Jan-16,FINANCIAL ADMINISTRATOR,155.56
2015 OFFICE OF THE SPEAKER,GENERAL EXPENDITURES,PERSONNEL COMPENSATION,DETAIL,   ,   ,   ,BOLDUC BRIAN J.,1-Jan-16,2-Jan-16,DIRECTOR OF SPEECHWRITING,583.33
2015 OFFICE OF THE SPEAKER,GENERAL EXPENDITURES,PERSONNEL COMPENSATION,DETAIL,   ,   ,   ,BROWN MARYAM S,1-Jan-16,2-Jan-16,APPOINTMENT DESK ASSISTANT,933.33
2015 OFFICE OF THE SPEAKER,GENERAL EXPENDITURES,PERSONNEL COMPENSATION,DETAIL,   ,   ,   ,BUCK BRENDAN K,1-Jan-16,2-Jan-16,CHIEF ADV ON COMMUNICATIONS,958.33
2015 OFFICE OF THE SPEAKER,GENERAL EXPENDITURES,PERSONNEL COMPENSATION,DETAIL,   ,   ,   ,BURKS JONATHAN,1-Jan-16,2-Jan-16,ASST TO SPEAKER FOR POLICY,729.53
2015 OFFICE OF THE SPEAKER,GENERAL EXPENDITURES,PERSONNEL COMPENSATION,DETAIL,   ,   ,   ,CALLAS GEORGE A,1-Jan-16,2-Jan-16,CHIEF TAX COUNSEL,948.31